{"text_format":"1","workbook":"xlsx","n_sheets":7,"sheets":["Current PO Checklist","Acerno_Cache_XXXXX","PO Scoring Summary","Individual PO's Scorecard","PO Line Review","Buyer Pivot","Lookups"],"not_rendered":{"charts":0,"images":1,"macros":1,"external_links":2,"defined_names":43,"comments":0,"pivot_tables":1},"unopened":[],"bounds":{"document_bytes":16777216,"sheet_cells":100000,"rows_first":2000,"rows_last":500,"rows_between":2000,"halvings":0,"cell_chars":16384,"cell_head_chars":4096},"cells_cut":0,"cells_raw":0,"read":"whole","date_system":"1900"}

{"sheet":"Current PO Checklist","index":0,"n_rows":224,"n_cols":4,"rows_kept":224,"cut":false,"hidden":true,"merged":[]}
[null,"Purpose"]
[null,"The purpose of the PO Analysis is to determine if procurement staff are processing purchases according to the Purchasing Act (Section 50-5 of the Official Code of Georgia, Annotated [O.C.G.A.]), the Georgia Procurement Manual (GPM), and applicable best practices.   "]
[null,"The PO Analysis includes four types of reviews:"]
[null,"Purchase Type Review "]
[null,"The PO Workbook contains one tab for each purchase type.  When preparing the workbook, ensure that only purchase orders with the code reflected in the tab name are on that spreadsheet (e.g. the “OMP” tab will contain only Open Market purchase orders).  In the comment section of the purchase order workbook, document any errors revealed during the review."]
[null,"Using the corresponding checklist questions below, determine if correct purchase type codes were applied for each of the purchase orders that are sampled in the PO Workbook."]
[null,"NOTE:"]
[null,"Each purchase order sampled will be reviewed for Compliance (C) or Non-Compliance (NC).  Points are awarded for Compliance based on the questions listed and if there are no issues, a total of 20 points will be awarded per purchase order.  Points are subtracted for each question when non-compliance is found.  "]
[null,"Tier One (1)"]
[null,"A.    Statewide Contract Mandatory (SWCM) ","C","NC"]
[null,"1. Is the PO coded correctly?",3]
[null,"2. Determine if the correct process was followed:",15]
[null,"·         Were the goods/services purchased available on a Mandatory Statewide Contract found in Window Shopper?  (Window Shopper can be accessed at: http://doas.ga.gov/TGM/Pages/WindowShopper.aspx to verify.)"]
[null,"·         Was the correct contract number used?"]
[null,"3. Did the purchase order description clearly identify the goods/services purchased?",2]
{"$rows_left_out":210}
{"sheet":"Acerno_Cache_XXXXX","index":1,"n_rows":0,"n_cols":0,"rows_kept":0,"cut":false,"hidden":true,"merged":[]}

{"sheet":"PO Scoring Summary","index":2,"n_rows":33,"n_cols":10,"rows_kept":33,"cut":false,"hidden":false,"merged":[[21,4,23,4],[0,0,0,8],[24,5,24,9],[25,5,33,9],[13,4,14,4],[13,5,14,5],[13,6,14,6],[13,7,14,7],[13,8,14,8],[22,7,22,8],[19,0,19,3],[5,0,5,1],[9,0,10,0],[21,7,21,8],[16,5,16,9],[17,5,17,6],[2,1,2,2],[18,7,18,8],[20,7,20,8],[19,7,19,8],[13,3,14,3],[17,7,17,8]]}
["<Select Entity Name from List>"]
[]
["Completed by:"]
["Date:"]
[]
["Scoring Summary",null,null,"Criteria","PO Type","Order of Precedence","Clear Description","Correct 3-Digit NIGP","Other Specific Procedures"]
["Max Pts Available",{"$f":"IF(SUM(max_score)=0,\"\",SUM(max_score))","v":""},null,"Criteria Points",3,4,3,3,3]
["Points Earned",{"$f":"IF(SUM(po_rating)=0,\"\",SUM(po_rating))","v":""},null,"# of Compliant",{"$f":"COUNTIF(type,\"Yes\")","v":0},{"$f":"COUNTIF(source,\"Yes\")","v":0},{"$f":"COUNTIF(clear_desc,\"Yes\")","v":0},{"$f":"COUNTIF(nigp,\"Yes\")","v":0},{"$f":"COUNTIF(specific,\"Yes\")","v":0}]
[null,null,null,"# of Non-compliant",{"$f":"COUNTIF(type,\"No\")","v":0},{"$f":"COUNTIF(source,\"No\")","v":0},{"$f":"IF(SUM(po_rating)=0,\"\",COUNTIF(description,\"No\"))","v":""},{"$f":"IF(SUM(po_rating)=0,\"\",COUNTIF(nigp,\"No\"))","v":""},{"$f":"COUNTIF(specific,\"No\")","v":0}]
["Compliance Rating / Tier",{"$f":"IF(ISBLANK(B3)=TRUE,\"Enter Completed By Above\",IF(ISERROR(ROUND((SUM(po_rating)/SUM(max_score)),2))=TRUE,\"No Data\",ROUND((SUM(po_rating)/SUM(max_score)),2)))","v":"Enter Completed By Above"},null,"# of Other/Needs Improve.",{"$f":"COUNTIF(type,\"Needs Improvement\")","v":0},{"$f":"COUNTIF(source,\"Needs Improvement\")","v":0},{"$f":"IF(SUM(po_rating)=0,\"\",C18-G8-G9)","v":""},{"$f":"COUNTIF(nigp,\"Needs Improvement\")","v":0},{"$f":"COUNTIF(specific,\"Needs Improvement\")","v":0}]
[null,{"$f":"IF(ISBLANK(B3)=TRUE,\"Enter Completed By Above\",IF(B10<=G23,J23,IF(B10<=G22,J22,IF(B10<=G21,J21,IF(B10<=G20,J20,J19)))))","v":"Enter Completed By Above"},null,"Points Earned",{"$f":"SUM(score_po_type)","v":0},{"$f":"SUM(score_op)","v":0},{"$f":"IF(SUM(po_rating)=0,\"\",SUM(score_desc))","v":""},{"$f":"SUM(score_nigp)","v":0},{"$f":"SUM(score_proc)","v":0}]
[null,null,null,"Possible Points",{"$f":"B18*E7","v":0},{"$f":"B18*F7","v":0},{"$f":"B18*G7","v":0},{"$f":"B18*H7","v":0},{"$f":"B18*I7","v":0}]
[null,null,null,"Score for Area",{"$f":"IF(SUM(po_rating)=0,\"\",IF(ISERROR(E11/E12)=TRUE,\"No Data\",E11/E12))","v":""},{"$f":"IF(SUM(po_rating)=0,\"\",IF(ISERROR(F11/F12)=TRUE,\"No Data\",F11/F12))","v":""},{"$f":"IF(SUM(po_rating)=0,\"\", IF(ISERROR(G11/G12)=TRUE,\"No Data\",G11/G12))","v":""},{"$f":"IF(SUM(po_rating)=0,\"\",IF(ISERROR(H11/H12)=TRUE,\"No Data\",H11/H12))","v":""},{"$f":"IF(SUM(po_rating)=0,\"\",IF(ISERROR(I11/I12)=TRUE,\"No Data\",I11/I12))","v":""}]
[null,null,null,"Type of Write-up",{"$f":"IF(E13=\"No Data\",\"No Data\",IF(E13<0.8,\"Issue\",IF(AND(E13<0.95,E13>=0.8),\"Issue\",IF(E13<1,\"Other Recommendation\",\"No Comments\"))))","v":"No Comments"},{"$f":"IF(F13=\"No Data\",\"No Data\",IF(F13<0.8,\"Issue\",IF(AND(F13<0.95,F13>=0.8),\"Issue\",IF(F13<1,\"Other Recommendation\",\"No Comments\"))))","v":"No Comments"},"No Comments","No Comments","No Comments"]
[]
{"$rows_left_out":19}
{"sheet":"Individual PO's Scorecard","index":3,"n_rows":479,"n_cols":27,"rows_kept":479,"cut":false,"hidden":false,"merged":[]}
["Entity_Name","PO_Num","PO_Date","PO_Type","Vendor_Name","Buyer","Origin","PO_Amt","PO_Line_Count (do not copy over this column)","Comments_/_Questions_for_Entity_Response","Correct_PO_Type?","Order_of_Precedence?","Other_Specific_Procedures?","Clear_Description?","Clear_Desc_Count","Desc_NI","Correct_3-Digit_NIGP?","Correct_3__Count","NIGP_3_NI","Individual_PO_Rating","Max_Score_for_PO","PO_Type","OP","Desc","NIGP","Proc.","Blanks"]
[null,null,null,null,null,null,null,null,{"$f":"IF(COUNTIF(line_review_PO,B2)=0,\"\",COUNTIF(line_review_PO,B2))","v":""},null,null,null,null,{"$f":"IF(ISBLANK(B2)=TRUE,\"\",IF(AND(I2=O2,P2=0),\"Yes\",IF(AND(O2=0,P2>0),\"No\",\"Needs Improvement\")))","v":""},{"$f":"COUNTIFS(line_review_PO,B2,clear_desc,\"=Yes\")","v":0},{"$f":"COUNTIFS(line_review_PO,B2,clear_desc,\"<>Yes\")","v":0},{"$f":"IF(ISBLANK(B2)=TRUE,\"\",IF(AND(I2=R2,S2=0),\"Yes\",IF(R2=0,\"No\",\"Needs Improvement\")))","v":""},{"$f":"COUNTIFS(line_review_PO,B2,correct_3,\"Yes\")","v":0},{"$f":"COUNTIFS(line_review_PO,B2,correct_3,\"Needs Improvement\")","v":0},{"$f":"IF(ISBLANK(B2)=TRUE,\"\",IF(AA2>0,\"\",SUM(V2:Z2)))","v":""},{"$f":"IF(ISBLANK(B2)=TRUE,\"No PO\",IF(M2<>\"N/A\",SUM(max_pts),SUM(max_pts)-'PO Scoring Summary'!$I$7))","v":"No PO"},{"$f":"IF(K2=\"Yes\",'PO Scoring Summary'!$E$7,IF(K2=\"No\",0,\"\"))","v":""},{"$f":"IF(L2=\"Yes\",'PO Scoring Summary'!$F$7,IF(L2=\"No\",0,\"\"))","v":""},{"$f":"IF(N2=\"\",\"\",IF(N2=\"Yes\",'PO Scoring Summary'!$G$7,IF(P2=1,ROUNDUP('PO Scoring Summary'!$G$7*0.5,0),0)))","v":""},{"$f":"IF(Q2=\"\",\"\",IF(Q2=\"Yes\",'PO Scoring Summary'!$H$7,IF(Q2=\"No\",0,ROUNDUP('PO Scoring Summary'!$H$7*0.5,0))))","v":""},{"$f":"IF(M2=\"Yes\",'PO Scoring Summary'!$I$7,IF(OR(M2=\"No\",M2=\"N/A\"),0,IF(ISBLANK(M2)=TRUE,\"\",ROUNDUP('PO Scoring Summary'!$I$7*0.5,0))))","v":""},{"$f":"COUNTIF(K2:M2,\"\")","v":3}]
[null,null,null,null,null,null,null,null,"",null,null,null,null,"",0,0,"",0,0,"",{"$f":"IF(ISBLANK(B3)=TRUE,\"No PO\",IF(M3<>\"N/A\",SUM(max_pts),SUM(max_pts)-'PO Scoring Summary'!$I$7))","v":"No PO"},{"$f":"IF(K3=\"Yes\",'PO Scoring Summary'!$E$7,IF(K3=\"No\",0,\"\"))","v":""},{"$f":"IF(L3=\"Yes\",'PO Scoring Summary'!$F$7,IF(L3=\"No\",0,\"\"))","v":""},{"$f":"IF(N3=\"\",\"\",IF(N3=\"Yes\",'PO Scoring Summary'!$G$7,IF(P3=1,ROUNDUP('PO Scoring Summary'!$G$7*0.5,0),0)))","v":""},{"$f":"IF(Q3=\"\",\"\",IF(Q3=\"Yes\",'PO Scoring Summary'!$H$7,IF(Q3=\"No\",0,ROUNDUP('PO Scoring Summary'!$H$7*0.5,0))))","v":""},{"$f":"IF(M3=\"Yes\",'PO Scoring Summary'!$I$7,IF(OR(M3=\"No\",M3=\"N/A\"),0,IF(ISBLANK(M3)=TRUE,\"\",ROUNDUP('PO Scoring Summary'!$I$7*0.5,0))))","v":""},3]
[null,null,null,null,null,null,null,null,"",null,null,null,null,"",0,0,"",0,0,"",{"$f":"IF(ISBLANK(B4)=TRUE,\"No PO\",IF(M4<>\"N/A\",SUM(max_pts),SUM(max_pts)-'PO Scoring Summary'!$I$7))","v":"No PO"},{"$f":"IF(K4=\"Yes\",'PO Scoring Summary'!$E$7,IF(K4=\"No\",0,\"\"))","v":""},{"$f":"IF(L4=\"Yes\",'PO Scoring Summary'!$F$7,IF(L4=\"No\",0,\"\"))","v":""},{"$f":"IF(N4=\"\",\"\",IF(N4=\"Yes\",'PO Scoring Summary'!$G$7,IF(P4=1,ROUNDUP('PO Scoring Summary'!$G$7*0.5,0),0)))","v":""},{"$f":"IF(Q4=\"\",\"\",IF(Q4=\"Yes\",'PO Scoring Summary'!$H$7,IF(Q4=\"No\",0,ROUNDUP('PO Scoring Summary'!$H$7*0.5,0))))","v":""},{"$f":"IF(M4=\"Yes\",'PO Scoring Summary'!$I$7,IF(OR(M4=\"No\",M4=\"N/A\"),0,IF(ISBLANK(M4)=TRUE,\"\",ROUNDUP('PO Scoring Summary'!$I$7*0.5,0))))","v":""},3]
[null,null,null,null,null,null,null,null,"",null,null,null,null,"",0,0,"",0,0,"",{"$f":"IF(ISBLANK(B5)=TRUE,\"No PO\",IF(M5<>\"N/A\",SUM(max_pts),SUM(max_pts)-'PO Scoring Summary'!$I$7))","v":"No PO"},{"$f":"IF(K5=\"Yes\",'PO Scoring Summary'!$E$7,IF(K5=\"No\",0,\"\"))","v":""},{"$f":"IF(L5=\"Yes\",'PO Scoring Summary'!$F$7,IF(L5=\"No\",0,\"\"))","v":""},{"$f":"IF(N5=\"\",\"\",IF(N5=\"Yes\",'PO Scoring Summary'!$G$7,IF(P5=1,ROUNDUP('PO Scoring Summary'!$G$7*0.5,0),0)))","v":""},{"$f":"IF(Q5=\"\",\"\",IF(Q5=\"Yes\",'PO Scoring Summary'!$H$7,IF(Q5=\"No\",0,ROUNDUP('PO Scoring Summary'!$H$7*0.5,0))))","v":""},{"$f":"IF(M5=\"Yes\",'PO Scoring Summary'!$I$7,IF(OR(M5=\"No\",M5=\"N/A\"),0,IF(ISBLANK(M5)=TRUE,\"\",ROUNDUP('PO Scoring Summary'!$I$7*0.5,0))))","v":""},3]
[null,null,null,null,null,null,null,null,"",null,null,null,null,"",0,0,"",0,0,"",{"$f":"IF(ISBLANK(B6)=TRUE,\"No PO\",IF(M6<>\"N/A\",SUM(max_pts),SUM(max_pts)-'PO Scoring Summary'!$I$7))","v":"No PO"},{"$f":"IF(K6=\"Yes\",'PO Scoring Summary'!$E$7,IF(K6=\"No\",0,\"\"))","v":""},{"$f":"IF(L6=\"Yes\",'PO Scoring Summary'!$F$7,IF(L6=\"No\",0,\"\"))","v":""},{"$f":"IF(N6=\"\",\"\",IF(N6=\"Yes\",'PO Scoring Summary'!$G$7,IF(P6=1,ROUNDUP('PO Scoring Summary'!$G$7*0.5,0),0)))","v":""},{"$f":"IF(Q6=\"\",\"\",IF(Q6=\"Yes\",'PO Scoring Summary'!$H$7,IF(Q6=\"No\",0,ROUNDUP('PO Scoring Summary'!$H$7*0.5,0))))","v":""},{"$f":"IF(M6=\"Yes\",'PO Scoring Summary'!$I$7,IF(OR(M6=\"No\",M6=\"N/A\"),0,IF(ISBLANK(M6)=TRUE,\"\",ROUNDUP('PO Scoring Summary'!$I$7*0.5,0))))","v":""},3]
[null,null,null,null,null,null,null,null,"",null,null,null,null,"",0,0,"",0,0,"",{"$f":"IF(ISBLANK(B7)=TRUE,\"No PO\",IF(M7<>\"N/A\",SUM(max_pts),SUM(max_pts)-'PO Scoring Summary'!$I$7))","v":"No PO"},{"$f":"IF(K7=\"Yes\",'PO Scoring Summary'!$E$7,IF(K7=\"No\",0,\"\"))","v":""},{"$f":"IF(L7=\"Yes\",'PO Scoring Summary'!$F$7,IF(L7=\"No\",0,\"\"))","v":""},{"$f":"IF(N7=\"\",\"\",IF(N7=\"Yes\",'PO Scoring Summary'!$G$7,IF(P7=1,ROUNDUP('PO Scoring Summary'!$G$7*0.5,0),0)))","v":""},{"$f":"IF(Q7=\"\",\"\",IF(Q7=\"Yes\",'PO Scoring Summary'!$H$7,IF(Q7=\"No\",0,ROUNDUP('PO Scoring Summary'!$H$7*0.5,0))))","v":""},{"$f":"IF(M7=\"Yes\",'PO Scoring Summary'!$I$7,IF(OR(M7=\"No\",M7=\"N/A\"),0,IF(ISBLANK(M7)=TRUE,\"\",ROUNDUP('PO Scoring Summary'!$I$7*0.5,0))))","v":""},3]
[null,null,null,null,null,null,null,null,"",null,null,null,null,"",0,0,"",0,0,"",{"$f":"IF(ISBLANK(B8)=TRUE,\"No PO\",IF(M8<>\"N/A\",SUM(max_pts),SUM(max_pts)-'PO Scoring Summary'!$I$7))","v":"No PO"},{"$f":"IF(K8=\"Yes\",'PO Scoring Summary'!$E$7,IF(K8=\"No\",0,\"\"))","v":""},{"$f":"IF(L8=\"Yes\",'PO Scoring Summary'!$F$7,IF(L8=\"No\",0,\"\"))","v":""},{"$f":"IF(N8=\"\",\"\",IF(N8=\"Yes\",'PO Scoring Summary'!$G$7,IF(P8=1,ROUNDUP('PO Scoring Summary'!$G$7*0.5,0),0)))","v":""},{"$f":"IF(Q8=\"\",\"\",IF(Q8=\"Yes\",'PO Scoring Summary'!$H$7,IF(Q8=\"No\",0,ROUNDUP('PO Scoring Summary'!$H$7*0.5,0))))","v":""},{"$f":"IF(M8=\"Yes\",'PO Scoring Summary'!$I$7,IF(OR(M8=\"No\",M8=\"N/A\"),0,IF(ISBLANK(M8)=TRUE,\"\",ROUNDUP('PO Scoring Summary'!$I$7*0.5,0))))","v":""},3]
[null,null,null,null,null,null,null,null,"",null,null,null,null,"",0,0,"",0,0,"",{"$f":"IF(ISBLANK(B9)=TRUE,\"No PO\",IF(M9<>\"N/A\",SUM(max_pts),SUM(max_pts)-'PO Scoring Summary'!$I$7))","v":"No PO"},{"$f":"IF(K9=\"Yes\",'PO Scoring Summary'!$E$7,IF(K9=\"No\",0,\"\"))","v":""},{"$f":"IF(L9=\"Yes\",'PO Scoring Summary'!$F$7,IF(L9=\"No\",0,\"\"))","v":""},{"$f":"IF(N9=\"\",\"\",IF(N9=\"Yes\",'PO Scoring Summary'!$G$7,IF(P9=1,ROUNDUP('PO Scoring Summary'!$G$7*0.5,0),0)))","v":""},{"$f":"IF(Q9=\"\",\"\",IF(Q9=\"Yes\",'PO Scoring Summary'!$H$7,IF(Q9=\"No\",0,ROUNDUP('PO Scoring Summary'!$H$7*0.5,0))))","v":""},{"$f":"IF(M9=\"Yes\",'PO Scoring Summary'!$I$7,IF(OR(M9=\"No\",M9=\"N/A\"),0,IF(ISBLANK(M9)=TRUE,\"\",ROUNDUP('PO Scoring Summary'!$I$7*0.5,0))))","v":""},3]
[null,null,null,null,null,null,null,null,"",null,null,null,null,"",0,0,"",0,0,"",{"$f":"IF(ISBLANK(B10)=TRUE,\"No PO\",IF(M10<>\"N/A\",SUM(max_pts),SUM(max_pts)-'PO Scoring Summary'!$I$7))","v":"No PO"},{"$f":"IF(K10=\"Yes\",'PO Scoring Summary'!$E$7,IF(K10=\"No\",0,\"\"))","v":""},{"$f":"IF(L10=\"Yes\",'PO Scoring Summary'!$F$7,IF(L10=\"No\",0,\"\"))","v":""},{"$f":"IF(N10=\"\",\"\",IF(N10=\"Yes\",'PO Scoring Summary'!$G$7,IF(P10=1,ROUNDUP('PO Scoring Summary'!$G$7*0.5,0),0)))","v":""},{"$f":"IF(Q10=\"\",\"\",IF(Q10=\"Yes\",'PO Scoring Summary'!$H$7,IF(Q10=\"No\",0,ROUNDUP('PO Scoring Summary'!$H$7*0.5,0))))","v":""},{"$f":"IF(M10=\"Yes\",'PO Scoring Summary'!$I$7,IF(OR(M10=\"No\",M10=\"N/A\"),0,IF(ISBLANK(M10)=TRUE,\"\",ROUNDUP('PO Scoring Summary'!$I$7*0.5,0))))","v":""},3]
[null,null,null,null,null,null,null,null,"",null,null,null,null,"",0,0,"",0,0,"",{"$f":"IF(ISBLANK(B11)=TRUE,\"No PO\",IF(M11<>\"N/A\",SUM(max_pts),SUM(max_pts)-'PO Scoring Summary'!$I$7))","v":"No PO"},{"$f":"IF(K11=\"Yes\",'PO Scoring Summary'!$E$7,IF(K11=\"No\",0,\"\"))","v":""},{"$f":"IF(L11=\"Yes\",'PO Scoring Summary'!$F$7,IF(L11=\"No\",0,\"\"))","v":""},{"$f":"IF(N11=\"\",\"\",IF(N11=\"Yes\",'PO Scoring Summary'!$G$7,IF(P11=1,ROUNDUP('PO Scoring Summary'!$G$7*0.5,0),0)))","v":""},{"$f":"IF(Q11=\"\",\"\",IF(Q11=\"Yes\",'PO Scoring Summary'!$H$7,IF(Q11=\"No\",0,ROUNDUP('PO Scoring Summary'!$H$7*0.5,0))))","v":""},{"$f":"IF(M11=\"Yes\",'PO Scoring Summary'!$I$7,IF(OR(M11=\"No\",M11=\"N/A\"),0,IF(ISBLANK(M11)=TRUE,\"\",ROUNDUP('PO Scoring Summary'!$I$7*0.5,0))))","v":""},3]
[null,null,null,null,null,null,null,null,"",null,null,null,null,"",0,0,"",0,0,"",{"$f":"IF(ISBLANK(B12)=TRUE,\"No PO\",IF(M12<>\"N/A\",SUM(max_pts),SUM(max_pts)-'PO Scoring Summary'!$I$7))","v":"No PO"},{"$f":"IF(K12=\"Yes\",'PO Scoring Summary'!$E$7,IF(K12=\"No\",0,\"\"))","v":""},{"$f":"IF(L12=\"Yes\",'PO Scoring Summary'!$F$7,IF(L12=\"No\",0,\"\"))","v":""},{"$f":"IF(N12=\"\",\"\",IF(N12=\"Yes\",'PO Scoring Summary'!$G$7,IF(P12=1,ROUNDUP('PO Scoring Summary'!$G$7*0.5,0),0)))","v":""},{"$f":"IF(Q12=\"\",\"\",IF(Q12=\"Yes\",'PO Scoring Summary'!$H$7,IF(Q12=\"No\",0,ROUNDUP('PO Scoring Summary'!$H$7*0.5,0))))","v":""},{"$f":"IF(M12=\"Yes\",'PO Scoring Summary'!$I$7,IF(OR(M12=\"No\",M12=\"N/A\"),0,IF(ISBLANK(M12)=TRUE,\"\",ROUNDUP('PO Scoring Summary'!$I$7*0.5,0))))","v":""},3]
[null,null,null,null,null,null,null,null,"",null,null,null,null,"",0,0,"",0,0,"",{"$f":"IF(ISBLANK(B13)=TRUE,\"No PO\",IF(M13<>\"N/A\",SUM(max_pts),SUM(max_pts)-'PO Scoring Summary'!$I$7))","v":"No PO"},{"$f":"IF(K13=\"Yes\",'PO Scoring Summary'!$E$7,IF(K13=\"No\",0,\"\"))","v":""},{"$f":"IF(L13=\"Yes\",'PO Scoring Summary'!$F$7,IF(L13=\"No\",0,\"\"))","v":""},{"$f":"IF(N13=\"\",\"\",IF(N13=\"Yes\",'PO Scoring Summary'!$G$7,IF(P13=1,ROUNDUP('PO Scoring Summary'!$G$7*0.5,0),0)))","v":""},{"$f":"IF(Q13=\"\",\"\",IF(Q13=\"Yes\",'PO Scoring Summary'!$H$7,IF(Q13=\"No\",0,ROUNDUP('PO Scoring Summary'!$H$7*0.5,0))))","v":""},{"$f":"IF(M13=\"Yes\",'PO Scoring Summary'!$I$7,IF(OR(M13=\"No\",M13=\"N/A\"),0,IF(ISBLANK(M13)=TRUE,\"\",ROUNDUP('PO Scoring Summary'!$I$7*0.5,0))))","v":""},3]
[null,null,null,null,null,null,null,null,"",null,null,null,null,"",0,0,"",0,0,"",{"$f":"IF(ISBLANK(B14)=TRUE,\"No PO\",IF(M14<>\"N/A\",SUM(max_pts),SUM(max_pts)-'PO Scoring Summary'!$I$7))","v":"No PO"},{"$f":"IF(K14=\"Yes\",'PO Scoring Summary'!$E$7,IF(K14=\"No\",0,\"\"))","v":""},{"$f":"IF(L14=\"Yes\",'PO Scoring Summary'!$F$7,IF(L14=\"No\",0,\"\"))","v":""},{"$f":"IF(N14=\"\",\"\",IF(N14=\"Yes\",'PO Scoring Summary'!$G$7,IF(P14=1,ROUNDUP('PO Scoring Summary'!$G$7*0.5,0),0)))","v":""},{"$f":"IF(Q14=\"\",\"\",IF(Q14=\"Yes\",'PO Scoring Summary'!$H$7,IF(Q14=\"No\",0,ROUNDUP('PO Scoring Summary'!$H$7*0.5,0))))","v":""},{"$f":"IF(M14=\"Yes\",'PO Scoring Summary'!$I$7,IF(OR(M14=\"No\",M14=\"N/A\"),0,IF(ISBLANK(M14)=TRUE,\"\",ROUNDUP('PO Scoring Summary'!$I$7*0.5,0))))","v":""},3]
[null,null,null,null,null,null,null,null,"",null,null,null,null,"",0,0,"",0,0,"",{"$f":"IF(ISBLANK(B15)=TRUE,\"No PO\",IF(M15<>\"N/A\",SUM(max_pts),SUM(max_pts)-'PO Scoring Summary'!$I$7))","v":"No PO"},{"$f":"IF(K15=\"Yes\",'PO Scoring Summary'!$E$7,IF(K15=\"No\",0,\"\"))","v":""},{"$f":"IF(L15=\"Yes\",'PO Scoring Summary'!$F$7,IF(L15=\"No\",0,\"\"))","v":""},{"$f":"IF(N15=\"\",\"\",IF(N15=\"Yes\",'PO Scoring Summary'!$G$7,IF(P15=1,ROUNDUP('PO Scoring Summary'!$G$7*0.5,0),0)))","v":""},{"$f":"IF(Q15=\"\",\"\",IF(Q15=\"Yes\",'PO Scoring Summary'!$H$7,IF(Q15=\"No\",0,ROUNDUP('PO Scoring Summary'!$H$7*0.5,0))))","v":""},{"$f":"IF(M15=\"Yes\",'PO Scoring Summary'!$I$7,IF(OR(M15=\"No\",M15=\"N/A\"),0,IF(ISBLANK(M15)=TRUE,\"\",ROUNDUP('PO Scoring Summary'!$I$7*0.5,0))))","v":""},3]
{"$rows_left_out":465}
{"sheet":"PO Line Review","index":4,"n_rows":1004,"n_cols":18,"rows_kept":1004,"cut":false,"hidden":false,"merged":[]}
["Clear Description?","Comments","Correct 3-Digit NIGP?","Comments","PO Number","Status","PO Type","PO Date","Vendor ID","Vendor Name","Buyer","PO Line","PO Line Amount","PO Line Description","Five-Digit NIGP","Five-Digit NIGP Description","Three-Digit NIGP Description","PO Reference"]
[]
[]
[]
[]
[]
[]
[]
[]
[]
[]
[]
[]
[]
[]
{"$rows_left_out":990}
{"sheet":"Buyer Pivot","index":5,"n_rows":3,"n_cols":3,"rows_kept":3,"cut":false,"hidden":false,"merged":[]}
[null,null,"Row Labels"]
[null,null,"(blank)"]
[null,null,"Grand Total"]

{"sheet":"Lookups","index":6,"n_rows":112,"n_cols":10,"rows_kept":112,"cut":false,"hidden":true,"merged":[]}
["<Select Entity Name from List>","Entity_Code","Entity_Fin_Sys",null,null,null,0.95,"Tier I (+)","Excellent","Tier I (+): A State Entity’s performance in this category reflects strong compliance with all applicable laws and administrative rules.  No significant weaknesses were identified.  Staff appears to be well-trained and are following both State and internal policies and procedures.  Any violations are minor and are easily corrected.  Risk of financial loss and/or accusations of improper procurement practices is very minimal and is not a concern at this time."]
["Abraham Baldwin Agricultural College (55700)",55700,"BOR PeopleSoft",null,null,null,0.85,"Tier I","Acceptable","Tier I: A State Entity’s performance in this category reflects compliance within acceptable parameters.  Adherence to training and policies appears to be adequate.  Any violations of laws and administrative rules are minor and are easily correctable.  Additional coaching for buyers indicated on the solicitations or purchase orders is recommended.  Risk of financial loss and/or accusations of improper procurement practices is minimal and should not be a concern at this time.  However, additional training will reduce the risk."]
["Administrative Services, Department of (40300)",40300,"TGM",null,null,null,0.75,"Tier II","Marginal","Tier II: A State Entity’s performance is less than satisfactory and indicates some lack of compliance with established laws and/or administrative rules that govern the purchase order and solicitation processes.  Increased attention is needed to training and auditing the work of the individual buyers.  Risk of financial loss and/or accusations of improper procurement practices exists but is minimal depending on the actual procurement area."]
["Agriculture, Department of (40200)",40200,"TGM",null,null,null,0.6,"Tier III","Underperforming","Tier III: A State Entity’s performance shows significant non-compliance in the procurement area receiving this rating.  Procurement personnel demonstrate a significant need for additional training and require close supervision in order to complete procurements according to Georgia law and administrative rules.  The State Entity is at a moderate risk of financial loss and/or accusations of improper procurement practices.  Issues need timely attention in order to implement corrective measures."]
["Albany State University (52100)",52100,"BOR PeopleSoft",null,null,null,null,"Tier IV","Unsatisfactory","Tier IV: A State Entity’s procurement personnel require strong supervisory attention and monitoring of purchase orders and solicitations.  Activities demonstrate either lack of adequate training or disregard for State procurement laws and administrative rules.  This places the State Entity at significant risk of financial loss and/or accusations of improper procurement practices.   Issues need immediate attention in order to implement corrective measures."]
["Albany Technical College (82000)",82000,"TGM"]
["Armstrong State University (52400)",52400,"BOR PeopleSoft"]
["Atlanta Metropolitan State College (61000)","61000","BOR PeopleSoft"]
["Athens Technical College (82200)",82200,"TGM"]
["Atlanta Technical College (82300)",82300,"TGM"]
["Audits and Accounts, Department of (40400)",40400,"TGM"]
["Augusta Technical College (82400)",82400,"TGM"]
["Augusta University (51200)",51200,"BOR PeopleSoft"]
["Bainbridge College (56200)",56200,"BOR PeopleSoft"]
["Banking and Finance, Department of (40600)",40600,"TGM"]
{"$rows_left_out":97}